Reaction Details
TargetCytochrome P450 1A2
LigandBDBM50448118
Substrate/Competitorn/a
Meas. Tech.ChEMBL_1291757 (CHEMBL3124048)
IC50 700±n/a nM
Citation Estrada, AAChan, BKBaker-Glenn, CBeresford, ABurdick, DJChambers, MChen, HDominguez, SLDotson, JDrummond, JFlagella, MFuji, RGill, AHalladay, JHarris, SFHeffron, TPKleinheinz, TLee, DWLe Pichon, CELiu, XLyssikatos, JPMedhurst, ADMoffat, JGNash, KScearce-Levie, KSheng, ZShore, DGWong, SZhang, SZhang, XZhu, HSweeney, ZK Discovery of highly potent, selective, and brain-penetrant aminopyrazole leucine-rich repeat kinase 2 (LRRK2) small molecule inhibitors. J Med Chem57:921-36 (2014) 
 
Cytochrome P450 1A2
Name:Cytochrome P450 1A2
Type:Enzyme
Mol. Mass.:58423.38
Organism:Homo sapiens (Human)
Description:P05177
Residue:516
BDBM50448118
NameBDBM50448118
Synonyms:CHEMBL3122113 US11111235, No. 80 US9932325, Example 80
TypeSmall organic molecule
Emp. Form.C14H16F3N7
Mol. Mass.339.3189
SMILESCNc1nc(Nc2cn(nc2C)C(C)(C)C#N)ncc1C(F)(F)F