Reaction Details
TargetUrease
LigandBDBM50229993
Substrate/Competitorn/a
Meas. Tech.ChEMBL_1293003 (CHEMBL3122982)
Ki 20010±n/a nM
Citation Khan, KMNaz, FTaha, MKhan, APerveen, SChoudhary, MIVoelter, W Synthesis and in vitro urease inhibitory activity of N,N'-disubstituted thioureas. Eur J Med Chem74:314-23 (2014) 
 
Urease
Name:Urease
Type:Enzyme
Mol. Mass.:90746.20
Organism:Canavalia ensiformis (Jack bean) (Horse bean)
Description:P07374
Residue:840
BDBM50229993
NameBDBM50229993
Synonyms:2-thiourea Thiocarbamid Thiokarbamid thiocarbamide thiourea
TypeSmall organic molecule
Emp. Form.CH4N2S
Mol. Mass.76.121
SMILESNC(N)=S