Reaction Details
TargetSodium/glucose cotransporter 2
LigandBDBM50308469
Substrate/Competitorn/a
Meas. Tech.ChEMBL_1296575 (CHEMBL3130910)
IC50 0.800000±n/a nM
Citation Xu, GLv, BRoberge, JYXu, BDu, JDong, JChen, YPeng, KZhang, LTang, XFeng, YXu, MFu, WZhang, WZhu, LDeng, ZSheng, ZWelihinda, ASun, X Design, synthesis, and biological evaluation of deuterated C-aryl glycoside as a potent and long-acting renal sodium-dependent glucose cotransporter 2 inhibitor for the treatment of type 2 diabetes. J Med Chem57:1236-51 (2014) 
 
Sodium/glucose cotransporter 2
Name:Sodium/glucose cotransporter 2
Type:Protein
Mol. Mass.:72902.00
Organism:Homo sapiens (Human)
Description:P31639
Residue:672
BDBM50308469
NameBDBM50308469
Synonyms:(2S,3R,4R,5S,6R)-2-(4-chloro-3-(4-methoxybenzyl)phenyl)-6-(hydroxymethyl)tetrahydro-2H-pyran-3,4,5-triol CHEMBL3125315 CHEMBL589305
TypeSmall organic molecule
Emp. Form.C20H23ClO6
Mol. Mass.394.846
SMILESCOc1ccc(Cc2cc(ccc2Cl)[C@@H]2O[C@H](CO)[C@@H](O)[C@H](O)[C@H]2O)cc1