Reaction Details
TargetProstaglandin D2 receptor 2
LigandBDBM50449259
Substrate/Competitorn/a
Meas. Tech.ChEMBL_1295165 (CHEMBL3128666)
Ki 1.6±n/a nM
Citation Xiao, DZhu, XYu, YShao, NWu, JMcCormick, KDDhondi, PQin, JMazzola, RTang, HRao, ASiliphaivanh, PQiu, HYang, XRivelli, MGarlisi, CGEckel, SMukhopadhyay, GCorrell, CRindgen, DAslanian, RPalani, A Quality by design (QbD) of amide isosteres: 5,5-Disubstituted isoxazolines as potent CRTh2 antagonists with favorable pharmacokinetic and drug-like properties. Bioorg Med Chem Lett24:1615-20 (2014) 
 
Prostaglandin D2 receptor 2
Name:Prostaglandin D2 receptor 2
Type:Enzyme
Mol. Mass.:43295.45
Organism:Homo sapiens (Human)
Description:Q9Y5Y4
Residue:395
BDBM50449259
NameBDBM50449259
Synonyms:CHEMBL3125329
TypeSmall organic molecule
Emp. Form.C32H32FN3O4
Mol. Mass.541.6126
SMILESCCCCC1(CC(=NO1)c1ccc2c(c1)nc(CCCCC(O)=O)n(-c1ccc(F)cc1)c2=O)c1ccccc1