Reaction Details
TargetProstaglandin D2 receptor 2
LigandBDBM50449262
Substrate/Competitorn/a
Meas. Tech.ChEMBL_1295165 (CHEMBL3128666)
Ki 14±n/a nM
Citation Xiao, DZhu, XYu, YShao, NWu, JMcCormick, KDDhondi, PQin, JMazzola, RTang, HRao, ASiliphaivanh, PQiu, HYang, XRivelli, MGarlisi, CGEckel, SMukhopadhyay, GCorrell, CRindgen, DAslanian, RPalani, A Quality by design (QbD) of amide isosteres: 5,5-Disubstituted isoxazolines as potent CRTh2 antagonists with favorable pharmacokinetic and drug-like properties. Bioorg Med Chem Lett24:1615-20 (2014) 
 
Prostaglandin D2 receptor 2
Name:Prostaglandin D2 receptor 2
Type:Enzyme
Mol. Mass.:43295.45
Organism:Homo sapiens (Human)
Description:Q9Y5Y4
Residue:395
BDBM50449262
NameBDBM50449262
Synonyms:CHEMBL3125332
TypeSmall organic molecule
Emp. Form.C34H28FN3O4
Mol. Mass.561.6022
SMILESOC(=O)CCCCc1nc2cc(ccc2c(=O)n1-c1ccc(F)cc1)C1=NOC(C1)(c1ccccc1)c1ccccc1