Reaction Details
TargetPeroxisome proliferator-activated receptor gamma
LigandBDBM50418573
Substrate/Competitorn/a
Meas. Tech.ChEMBL_154374 (CHEMBL758983)
EC50 1148±n/a nM
Citation Henke, BRBlanchard, SGBrackeen, MFBrown, KKCobb, JECollins, JLHarrington, WWHashim, MAHull-Ryde, EAKaldor, IKliewer, SALake, DHLeesnitzer, LMLehmann, JMLenhard, JMOrband-Miller, LAMiller, JFMook, RANoble, SAOliver, WParks, DJPlunket, KDSzewczyk, JRWillson, TM N-(2-Benzoylphenyl)-L-tyrosine PPARgamma agonists. 1. Discovery of a novel series of potent antihyperglycemic and antihyperlipidemic agents. J Med Chem41:5020-36 (1999) 
 
Peroxisome proliferator-activated receptor gamma
Name:Peroxisome proliferator-activated receptor gamma
Type:Nuclear Receptor
Mol. Mass.:57613.46
Organism:Homo sapiens (Human)
Description:P37231
Residue:505
BDBM50418573
NameBDBM50418573
Synonyms:CHEMBL147694
TypeSmall organic molecule
Emp. Form.C32H28N2O6
Mol. Mass.536.5745
SMILESCN(CCOc1ccc(CC(Oc2ccccc2C(=O)c2ccccc2)C(O)=O)cc1)c1nc2ccccc2o1