Reaction Details
TargetPeroxisome proliferator-activated receptor gamma
LigandBDBM50418557
Substrate/Competitorn/a
Meas. Tech.ChEMBL_154378 (CHEMBL758987)
EC50 229±n/a nM
Citation Henke, BRBlanchard, SGBrackeen, MFBrown, KKCobb, JECollins, JLHarrington, WWHashim, MAHull-Ryde, EAKaldor, IKliewer, SALake, DHLeesnitzer, LMLehmann, JMLenhard, JMOrband-Miller, LAMiller, JFMook, RANoble, SAOliver, WParks, DJPlunket, KDSzewczyk, JRWillson, TM N-(2-Benzoylphenyl)-L-tyrosine PPARgamma agonists. 1. Discovery of a novel series of potent antihyperglycemic and antihyperlipidemic agents. J Med Chem41:5020-36 (1999) 
 
Peroxisome proliferator-activated receptor gamma
Name:Peroxisome proliferator-activated receptor gamma
Type:Nuclear Receptor
Mol. Mass.:57613.46
Organism:Homo sapiens (Human)
Description:P37231
Residue:505
BDBM50418557
NameBDBM50418557
Synonyms:CHEMBL1785028
TypeSmall organic molecule
Emp. Form.C26H25NO4
Mol. Mass.415.481
SMILESCC(CC(=O)c1ccccc1)=N[C@@H](Cc1ccc(OCc2ccccc2)cc1)C(O)=O