Reaction Details
TargetPeroxisome proliferator-activated receptor gamma
LigandBDBM50000018
Substrate/Competitorn/a
Meas. Tech.ChEMBL_154529 (CHEMBL760250)
Ki<3162±n/a nM
Citation Henke, BRBlanchard, SGBrackeen, MFBrown, KKCobb, JECollins, JLHarrington, WWHashim, MAHull-Ryde, EAKaldor, IKliewer, SALake, DHLeesnitzer, LMLehmann, JMLenhard, JMOrband-Miller, LAMiller, JFMook, RANoble, SAOliver, WParks, DJPlunket, KDSzewczyk, JRWillson, TM N-(2-Benzoylphenyl)-L-tyrosine PPARgamma agonists. 1. Discovery of a novel series of potent antihyperglycemic and antihyperlipidemic agents. J Med Chem41:5020-36 (1999) 
 
Peroxisome proliferator-activated receptor gamma
Name:Peroxisome proliferator-activated receptor gamma
Type:Nuclear Receptor
Mol. Mass.:57613.46
Organism:Homo sapiens (Human)
Description:P37231
Residue:505
BDBM50000018
NameBDBM50000018
Synonyms:CHEMBL146243
TypeSmall organic molecule
Emp. Form.C29H29NO4
Mol. Mass.455.5449
SMILESCOC(=O)[C@H](Cc1ccc(OCc2ccccc2)cc1)\N=C(/C)C1=C(O)c2ccccc2CC1