Reaction Details
TargetPeroxisome proliferator-activated receptor gamma
LigandBDBM50049243
Substrate/Competitorn/a
Meas. Tech.ChEMBL_154529 (CHEMBL760250)
Ki 3090±n/a nM
Citation Henke, BRBlanchard, SGBrackeen, MFBrown, KKCobb, JECollins, JLHarrington, WWHashim, MAHull-Ryde, EAKaldor, IKliewer, SALake, DHLeesnitzer, LMLehmann, JMLenhard, JMOrband-Miller, LAMiller, JFMook, RANoble, SAOliver, WParks, DJPlunket, KDSzewczyk, JRWillson, TM N-(2-Benzoylphenyl)-L-tyrosine PPARgamma agonists. 1. Discovery of a novel series of potent antihyperglycemic and antihyperlipidemic agents. J Med Chem41:5020-36 (1999) 
 
Peroxisome proliferator-activated receptor gamma
Name:Peroxisome proliferator-activated receptor gamma
Type:Nuclear Receptor
Mol. Mass.:57613.46
Organism:Homo sapiens (Human)
Description:P37231
Residue:505
BDBM50049243
NameBDBM50049243
Synonyms:5-[4-(1-Methyl-cyclohexylmethoxy)-benzyl]-thiazolidine-2,4-dione 5-[4-(1-Methyl-cyclohexylmethoxy)-benzyl]-thiazolidine-2,4-dione(Ciglitazone) CIGLITAZONE | US8637558, 112
TypeSmall organic molecule
Emp. Form.C18H23NO3S
Mol. Mass.333.445
SMILESCC1(COc2ccc(Cc3sc(=O)[nH]c3O)cc2)CCCCC1