Reaction Details
TargetPeroxisome proliferator-activated receptor gamma
LigandBDBM50049244
Substrate/Competitorn/a
Meas. Tech.ChEMBL_154378 (CHEMBL758987)
EC50 11±n/a nM
Citation Henke, BRBlanchard, SGBrackeen, MFBrown, KKCobb, JECollins, JLHarrington, WWHashim, MAHull-Ryde, EAKaldor, IKliewer, SALake, DHLeesnitzer, LMLehmann, JMLenhard, JMOrband-Miller, LAMiller, JFMook, RANoble, SAOliver, WParks, DJPlunket, KDSzewczyk, JRWillson, TM N-(2-Benzoylphenyl)-L-tyrosine PPARgamma agonists. 1. Discovery of a novel series of potent antihyperglycemic and antihyperlipidemic agents. J Med Chem41:5020-36 (1999) 
 
Peroxisome proliferator-activated receptor gamma
Name:Peroxisome proliferator-activated receptor gamma
Type:Nuclear Receptor
Mol. Mass.:57613.46
Organism:Homo sapiens (Human)
Description:P37231
Residue:505
BDBM50049244
NameBDBM50049244
Synonyms:5-{4-[2-(Benzooxazol-2-yl-methyl-amino)-ethoxy]-benzyl}-thiazolidine-2,4-dione CHEMBL17805
TypeSmall organic molecule
Emp. Form.C20H19N3O4S
Mol. Mass.397.448
SMILESCN(CCOc1ccc(Cc2sc(=O)[nH]c2O)cc1)c1nc2ccccc2o1