Reaction Details
TargetBeta-1 adrenergic receptor
LigandBDBM50422411
Substrate/Competitorn/a
Meas. Tech.ChEMBL_352669 (CHEMBL862149)
EC50 79±n/a nM
Citation Uehling, DEShearer, BGDonaldson, KHChao, EYDeaton, DNAdkison, KKBrown, KKCariello, NFFaison, WLLancaster, MELin, JHart, RMilliken, TOPaulik, MASherman, BWSugg, EECowan, C Biarylaniline phenethanolamines as potent and selective beta3 adrenergic receptor agonists. J Med Chem49:2758-71 (2006) 
 
Beta-1 adrenergic receptor
Name:Beta-1 adrenergic receptor
Type:G Protein-Coupled Receptor (GPCR)
Mol. Mass.:51338.40
Organism:Homo sapiens (Human)
Description:P08588
Residue:477
BDBM50422411
NameBDBM50422411
Synonyms:CHEMBL154419
TypeSmall organic molecule
Emp. Form.C19H23ClN2O3
Mol. Mass.362.851
SMILESC[C@H](CNc1ccc(CC(O)=O)cc1)NC[C@H](O)c1cccc(Cl)c1