Reaction Details
TargetBeta-3 adrenergic receptor
LigandBDBM50002598
Substrate/Competitorn/a
Meas. Tech.ChEMBL_352666 (CHEMBL862145)
EC50 25±n/a nM
Citation Uehling, DEShearer, BGDonaldson, KHChao, EYDeaton, DNAdkison, KKBrown, KKCariello, NFFaison, WLLancaster, MELin, JHart, RMilliken, TOPaulik, MASherman, BWSugg, EECowan, C Biarylaniline phenethanolamines as potent and selective beta3 adrenergic receptor agonists. J Med Chem49:2758-71 (2006) 
 
Beta-3 adrenergic receptor
Name:Beta-3 adrenergic receptor
Type:G Protein-Coupled Receptor (GPCR)
Mol. Mass.:43534.88
Organism:Homo sapiens (Human)
Description:n/a
Residue:408
BDBM50002598
NameBDBM50002598
Synonyms:CHEMBL152535
TypeSmall organic molecule
Emp. Form.C19H21ClNO4
Mol. Mass.362.828
SMILESC[C@H](Cc1ccc(OCC([O-])=O)cc1)NC[C@H](O)c1cccc(Cl)c1