Reaction Details
Target5-hydroxytryptamine receptor 2C
LigandBDBM50002639
Substrate/Competitorn/a
Meas. Tech.ChEMBL_384211 (CHEMBL868581)
Ki 63±n/a nM
Citation Micheli, FPasquarello, ATedesco, GHamprecht, DBonanomi, GChecchia, AJaxa-Chamiec, ADamiani, FDavalli, SDonati, DGallotti, CPetrone, MRinaldi, MRiley, GTerreni, SWood, M Diaryl substituted pyrrolidinones and pyrrolones as 5-HT2C inhibitors: synthesis and biological evaluation. Bioorg Med Chem Lett16:3906-12 (2006) 
 
5-hydroxytryptamine receptor 2C
Name:5-hydroxytryptamine receptor 2C
Type:G Protein-Coupled Receptor (GPCR)
Mol. Mass.:51836.79
Organism:Homo sapiens (Human)
Description:P28335
Residue:458
BDBM50002639
NameBDBM50002639
Synonyms:CHEMBL380264
TypeSmall organic molecule
Emp. Form.C23H23Cl3N2O2
Mol. Mass.465.8
SMILESClc1ccc(cc1Cl)C1=CCN(C1=O)c1ccc(Cl)c(OCCN2CCCCC2)c1