Reaction Details
Target5-hydroxytryptamine receptor 2C
LigandBDBM50002668
Substrate/Competitorn/a
Meas. Tech.ChEMBL_384211 (CHEMBL868581)
Ki 3.2±n/a nM
Citation Micheli, FPasquarello, ATedesco, GHamprecht, DBonanomi, GChecchia, AJaxa-Chamiec, ADamiani, FDavalli, SDonati, DGallotti, CPetrone, MRinaldi, MRiley, GTerreni, SWood, M Diaryl substituted pyrrolidinones and pyrrolones as 5-HT2C inhibitors: synthesis and biological evaluation. Bioorg Med Chem Lett16:3906-12 (2006) 
 
5-hydroxytryptamine receptor 2C
Name:5-hydroxytryptamine receptor 2C
Type:G Protein-Coupled Receptor (GPCR)
Mol. Mass.:51836.79
Organism:Homo sapiens (Human)
Description:P28335
Residue:458
BDBM50002668
NameBDBM50002668
Synonyms:CHEMBL215864
TypeSmall organic molecule
Emp. Form.C25H29FN2O3
Mol. Mass.424.5078
SMILESCOc1ccc(cc1OCCN1CCC(C)CC1)N1CC=C(C1=O)c1ccc(F)cc1