Reaction Details
TargetAcetylcholinesterase
LigandBDBM10624
Substrate/Competitorn/a
Meas. Tech.ChEMBL_1278103 (CHEMBL3095601)
Ki 50±n/a nM
Citation Komloova, MHorova, AHrabinova, MJun, DDolezal, MVinsova, JKuca, KMusilek, K Preparation, in vitro evaluation and molecular modelling of pyridinium-quinolinium/isoquinolinium non-symmetrical bisquaternary cholinesterase inhibitors. Bioorg Med Chem Lett23:6663-6 (2013) 
 
Acetylcholinesterase
Name:Acetylcholinesterase
Type:Enzyme
Mol. Mass.:67792.70
Organism:Homo sapiens (Human)
Description:P22303
Residue:614
BDBM10624
NameBDBM10624
Synonyms:1,5-bis(4-allyldimethylammoniumphenyl)-pentan-3-one dibromide BW284c51 CHEMBL464538
TypeSmall organic molecule
Emp. Form.C27H38N2O
Mol. Mass.406.6023
SMILESC[N+](C)(CC=C)c1ccc(CCC(=O)CCc2ccc(cc2)[N+](C)(C)CC=C)cc1