Reaction Details
TargetAcetylcholinesterase
LigandBDBM120262
Substrate/Competitorn/a
Meas. Tech.ChEMBL_1278106 (CHEMBL3095604)
IC50 5170±n/a nM
Citation Komloova, MHorova, AHrabinova, MJun, DDolezal, MVinsova, JKuca, KMusilek, K Preparation, in vitro evaluation and molecular modelling of pyridinium-quinolinium/isoquinolinium non-symmetrical bisquaternary cholinesterase inhibitors. Bioorg Med Chem Lett23:6663-6 (2013) 
 
Acetylcholinesterase
Name:Acetylcholinesterase
Type:Enzyme
Mol. Mass.:67792.70
Organism:Homo sapiens (Human)
Description:P22303
Residue:614
BDBM120262
NameBDBM120262
Synonyms:EDROPHONIUM BROMIDE Edrophonium cid_8307
TypeSmall organic molecule
Emp. Form.C10H16NO
Mol. Mass.166.2396
SMILESCC[N+](C)(C)c1cccc(O)c1