Reaction Details
TargetPlasmepsin II
LigandBDBM50001067
Substrate/Competitorn/a
Meas. Tech.ChEMBL_1338068 (CHEMBL3241789)
Ki 4.4±n/a nM
Citation Miura, THidaka, KAzai, YKashimoto, KKawasaki, YChen, SEde Freitas, RFFreire, EKiso, Y Optimization of plasmepsin inhibitor by focusing on similar structural feature with chloroquine to avoid drug-resistant mechanism of Plasmodium falciparum. Bioorg Med Chem Lett24:1698-701 (2014) 
 
Plasmepsin II
Name:Plasmepsin II
Type:Enzyme
Mol. Mass.:51482.09
Organism:Plasmodium falciparum
Description:P46925
Residue:453
BDBM50001067
NameBDBM50001067
Synonyms:CHEMBL3236061
TypeSmall organic molecule
Emp. Form.C42H49N5O6S
Mol. Mass.751.933
SMILESCc1cccc(CNc2cc(C)c(OCC(=O)N[C@@H](Cc3ccccc3)[C@H](O)C(=O)N3CSC(C)(C)[C@H]3C(=O)N[C@@H]3[C@H](O)Cc4ccccc34)c(C)c2)n1