Reaction Details
TargetPlasmepsin II
LigandBDBM50001070
Substrate/Competitorn/a
Meas. Tech.ChEMBL_1338068 (CHEMBL3241789)
Ki 1.2±n/a nM
Citation Miura, THidaka, KAzai, YKashimoto, KKawasaki, YChen, SEde Freitas, RFFreire, EKiso, Y Optimization of plasmepsin inhibitor by focusing on similar structural feature with chloroquine to avoid drug-resistant mechanism of Plasmodium falciparum. Bioorg Med Chem Lett24:1698-701 (2014) 
 
Plasmepsin II
Name:Plasmepsin II
Type:Enzyme
Mol. Mass.:51482.09
Organism:Plasmodium falciparum
Description:P46925
Residue:453
BDBM50001070
NameBDBM50001070
Synonyms:CHEMBL3236064
TypeSmall organic molecule
Emp. Form.C37H45N5O7S
Mol. Mass.703.848
SMILESCc1cc(NC(=O)CN)cc(C)c1OCC(=O)N[C@@H](Cc1ccccc1)[C@H](O)C(=O)N1CSC(C)(C)[C@H]1C(=O)N[C@@H]1[C@H](O)Cc2ccccc12