Reaction Details
TargetSodium channel protein type 5 subunit alpha
LigandBDBM50003020
Substrate/Competitorn/a
Meas. Tech.ChEMBL_1335106 (CHEMBL3239613)
IC50>30000±n/a nM
Citation Biftu, TSinha-Roy, RChen, PQian, XFeng, DKuethe, JTScapin, GGao, YDYan, YKrueger, DBak, AEiermann, GHe, JCox, JHicks, JLyons, KHe, HSalituro, GTong, SPatel, SDoss, GPetrov, AWu, JXu, SSSewall, CZhang, XZhang, BThornberry, NAWeber, AE Omarigliptin (MK-3102): a novel long-acting DPP-4 inhibitor for once-weekly treatment of type 2 diabetes. J Med Chem57:3205-12 (2014) 
 
Sodium channel protein type 5 subunit alpha
Name:Sodium channel protein type 5 subunit alpha
Type:Enzyme
Mol. Mass.:226908.60
Organism:Homo sapiens (Human)
Description:Q14524
Residue:2016
BDBM50003020
NameBDBM50003020
Synonyms:MK-3102 US10155775, Omarigliptin US10822319, Compound Omarigliptin
TypeSmall organic molecule
Emp. Form.C17H20F2N4O3S
Mol. Mass.398.428
SMILESCS(=O)(=O)n1cc2CN(Cc2n1)[C@H]1CO[C@@H]([C@@H](N)C1)c1cc(F)ccc1F