Reaction Details
TargetTyrosine-protein kinase SYK
LigandBDBM50007106
Substrate/Competitorn/a
Meas. Tech.ChEMBL_1337879 (CHEMBL3240906)
IC50 5.0±n/a nM
Citation Lucas, MCBhagirath, NChiao, EGoldstein, DMHermann, JCHsu, PYKirchner, SKennedy-Smith, JJKuglstatter, ALukacs, CMenke, JNiu, LPadilla, FPeng, YPolonchuk, LRailkar, ASlade, MSoth, MXu, DYadava, PYee, CZhou, MLiao, C Using ovality to predict nonmutagenic, orally efficacious pyridazine amides as cell specific spleen tyrosine kinase inhibitors. J Med Chem57:2683-91 (2014) 
 
Tyrosine-protein kinase SYK
Name:Tyrosine-protein kinase SYK
Type:Enzyme
Mol. Mass.:72079.99
Organism:Homo sapiens (Human)
Description:P43405
Residue:635
BDBM50007106
NameBDBM50007106
Synonyms:CHEMBL3237574
TypeSmall organic molecule
Emp. Form.C20H29N7O2
Mol. Mass.399.49
SMILESCCCc1nc(Nc2cc(N[C@@H]3CCCC[C@@H]3N)nnc2C(N)=O)ccc1OC