Reaction Details
TargetEpidermal growth factor receptor
LigandBDBM50396483
Substrate/Competitorn/a
Meas. Tech.ChEMBL_1338377 (CHEMBL3240253)
IC50>10000±n/a nM
Citation Cheng, HChang, YZhang, LLuo, JTu, ZLu, XZhang, QLu, JRen, XDing, K Identification and optimization of new dual inhibitors of B-Raf and epidermal growth factor receptor kinases for overcoming resistance against vemurafenib. J Med Chem57:2692-703 (2014) 
 
Epidermal growth factor receptor
Name:Epidermal growth factor receptor
Type:Receptor Kinase Domain
Mol. Mass.:134279.59
Organism:Homo sapiens (Human)
Description:P00533
Residue:1210
BDBM50396483
NameBDBM50396483
Synonyms:PLX-4032 Ro 5185426 US11332479, Compound Vemurafenib US9388165, Reference, Vemurafenib (PLX-4032) VEMURAFENIB
TypeSmall organic molecule
Emp. Form.C23H18ClF2N3O3S
Mol. Mass.489.922
SMILESCCCS(=O)(=O)Nc1ccc(F)c(C(=O)c2c[nH]c3ncc(cc23)-c2ccc(Cl)cc2)c1F