Reaction Details
TargetE3 ubiquitin-protein ligase Mdm2
LigandBDBM50008760
Substrate/Competitorn/a
Meas. Tech.ChEMBL_1336776 (CHEMBL3241172)
IC50 1.8±n/a nM
Citation Gonzalez, AZLi, ZBeck, HPCanon, JChen, AChow, DDuquette, JEksterowicz, JFox, BMFu, JHuang, XHouze, JJin, LLi, YLing, YLo, MCLong, AMMcGee, LRMcIntosh, JOliner, JDOsgood, TRew, YSaiki, AYShaffer, PWortman, SYakowec, PYan, XYe, QYu, DZhao, XZhou, JOlson, SHSun, DMedina, JC Novel inhibitors of the MDM2-p53 interaction featuring hydrogen bond acceptors as carboxylic acid isosteres. J Med Chem57:2963-88 (2014) 
 
E3 ubiquitin-protein ligase Mdm2
Name:E3 ubiquitin-protein ligase Mdm2
Type:Oncoprotein
Mol. Mass.:55196.54
Organism:Homo sapiens (Human)
Description:Q00987
Residue:491
BDBM50008760
NameBDBM50008760
Synonyms:CHEMBL3236364
TypeSmall organic molecule
Emp. Form.C29H36Cl2N2O4S
Mol. Mass.579.578
SMILESCC(C)(C)S(=O)(=O)C[C@H](C1CC1)N1[C@@H]([C@H](C[C@](C)(CC(N)=O)C1=O)c1cccc(Cl)c1)c1ccc(Cl)cc1