Reaction Details
TargetDipeptidyl peptidase 2
LigandBDBM50009366
Substrate/Competitorn/a
Meas. Tech.ChEMBL_1335499 (CHEMBL3239284)
IC50>100000±n/a nM
Citation Jansen, KHeirbaut, LVerkerk, RCheng, JDJoossens, JCos, PMaes, LLambeir, AMDe Meester, IAugustyns, KVan der Veken, P Extended structure-activity relationship and pharmacokinetic investigation of (4-quinolinoyl)glycyl-2-cyanopyrrolidine inhibitors of fibroblast activation protein (FAP). J Med Chem57:3053-74 (2014) 
 
Dipeptidyl peptidase 2
Name:Dipeptidyl peptidase 2
Type:Protein
Mol. Mass.:54339.29
Organism:Homo sapiens (Human)
Description:Q9UHL4
Residue:492
BDBM50009366
NameBDBM50009366
Synonyms:CHEMBL3233842 US9346814, Cmpd No 1, Example 1
TypeSmall organic molecule
Emp. Form.C17H14F2N4O2
Mol. Mass.344.3155
SMILESFC1(F)C[C@@H](C#N)N(C1)C(=O)CNC(=O)c1ccnc2ccccc12