Reaction Details
TargetG-protein coupled receptor 183
LigandBDBM50011724
Substrate/Competitorn/a
Meas. Tech.ChEMBL_1351308 (CHEMBL3266157)
IC50 24±n/a nM
Citation Gessier, FPreuss, IYin, HRosenkilde, MMLaurent, SEndres, RChen, YAMarsilje, THSeuwen, KNguyen, DGSailer, AW Identification and characterization of small molecule modulators of the Epstein-Barr virus-induced gene 2 (EBI2) receptor. J Med Chem57:3358-68 (2014) 
 
G-protein coupled receptor 183
Name:G-protein coupled receptor 183
Type:PROTEIN
Mol. Mass.:41245.79
Organism:Homo sapiens (Human)
Description:ChEMBL_108311
Residue:361
BDBM50011724
NameBDBM50011724
Synonyms:CHEMBL3262882
TypeSmall organic molecule
Emp. Form.C21H20Cl2N2O2
Mol. Mass.403.302
SMILESClc1ccc(\C=C\C(=O)N2CCN(CC2)C(=O)Cc2ccccc2)cc1Cl