Reaction Details
TargetG-protein coupled receptor 183
LigandBDBM50011729
Substrate/Competitorn/a
Meas. Tech.ChEMBL_1351308 (CHEMBL3266157)
IC50 40±n/a nM
Citation Gessier, FPreuss, IYin, HRosenkilde, MMLaurent, SEndres, RChen, YAMarsilje, THSeuwen, KNguyen, DGSailer, AW Identification and characterization of small molecule modulators of the Epstein-Barr virus-induced gene 2 (EBI2) receptor. J Med Chem57:3358-68 (2014) 
 
G-protein coupled receptor 183
Name:G-protein coupled receptor 183
Type:PROTEIN
Mol. Mass.:41245.79
Organism:Homo sapiens (Human)
Description:ChEMBL_108311
Residue:361
BDBM50011729
NameBDBM50011729
Synonyms:CHEMBL3262887
TypeSmall organic molecule
Emp. Form.C22H24N2O3
Mol. Mass.364.4376
SMILESCOc1ccc(\C=C\C(=O)N2CCN(CC2)C(=O)c2ccc(C)cc2)cc1