Reaction Details
TargetG-protein coupled receptor 183
LigandBDBM50011725
Substrate/Competitorn/a
Meas. Tech.ChEMBL_1351309 (CHEMBL3266158)
IC50 46±n/a nM
Citation Gessier, FPreuss, IYin, HRosenkilde, MMLaurent, SEndres, RChen, YAMarsilje, THSeuwen, KNguyen, DGSailer, AW Identification and characterization of small molecule modulators of the Epstein-Barr virus-induced gene 2 (EBI2) receptor. J Med Chem57:3358-68 (2014) 
 
G-protein coupled receptor 183
Name:G-protein coupled receptor 183
Type:PROTEIN
Mol. Mass.:40205.57
Organism:Mus musculus
Description:ChEMBL_108312
Residue:357
BDBM50011725
NameBDBM50011725
Synonyms:CHEMBL3262883
TypeSmall organic molecule
Emp. Form.C22H23FN2O2
Mol. Mass.366.4286
SMILESCc1ccc(\C=C\C(=O)N2CCN(CC2)C(=O)Cc2ccccc2)cc1F