Reaction Details
TargetG-protein coupled receptor 183
LigandBDBM50011689
Substrate/Competitorn/a
Meas. Tech.ChEMBL_1351309 (CHEMBL3266158)
IC50 21±n/a nM
Citation Gessier, FPreuss, IYin, HRosenkilde, MMLaurent, SEndres, RChen, YAMarsilje, THSeuwen, KNguyen, DGSailer, AW Identification and characterization of small molecule modulators of the Epstein-Barr virus-induced gene 2 (EBI2) receptor. J Med Chem57:3358-68 (2014) 
 
G-protein coupled receptor 183
Name:G-protein coupled receptor 183
Type:PROTEIN
Mol. Mass.:40205.57
Organism:Mus musculus
Description:ChEMBL_108312
Residue:357
BDBM50011689
NameBDBM50011689
Synonyms:CHEMBL3262892
TypeSmall organic molecule
Emp. Form.C22H23ClN2O3
Mol. Mass.398.883
SMILESCOc1ccc(\C=C\C(=O)N2CCN(CC2)C(=O)c2ccc(Cl)c(C)c2)cc1