Reaction Details
TargetG-protein coupled receptor 183
LigandBDBM50011690
Substrate/Competitorn/a
Meas. Tech.ChEMBL_1351309 (CHEMBL3266158)
IC50 52±n/a nM
Citation Gessier, FPreuss, IYin, HRosenkilde, MMLaurent, SEndres, RChen, YAMarsilje, THSeuwen, KNguyen, DGSailer, AW Identification and characterization of small molecule modulators of the Epstein-Barr virus-induced gene 2 (EBI2) receptor. J Med Chem57:3358-68 (2014) 
 
G-protein coupled receptor 183
Name:G-protein coupled receptor 183
Type:PROTEIN
Mol. Mass.:40205.57
Organism:Mus musculus
Description:ChEMBL_108312
Residue:357
BDBM50011690
NameBDBM50011690
Synonyms:CHEMBL3262893
TypeSmall organic molecule
Emp. Form.C23H26N2O3
Mol. Mass.378.4641
SMILESCOc1ccc(\C=C\C(=O)N2CCN(CC2)C(=O)c2ccc(C)c(C)c2)cc1