Reaction Details
TargetCytochrome P450 2C8
LigandBDBM50012060
Substrate/Competitorn/a
Meas. Tech.ChEMBL_1351752 (CHEMBL3270541)
IC50 1400±n/a nM
Citation Shi, QTebben, ADyckman, AJLi, HLiu, CLin, JSpergel, SBurke, JRMcIntyre, KWOlini, GCStrnad, JSurti, NMuckelbauer, JKChang, CAn, YCheng, LRuan, QLeftheris, KCarter, PHTino, JDe Lucca, GV Purine derivatives as potent Bruton's tyrosine kinase (BTK) inhibitors for autoimmune diseases. Bioorg Med Chem Lett24:2206-11 (2014) 
 
Cytochrome P450 2C8
Name:Cytochrome P450 2C8
Type:Protein
Mol. Mass.:55839.23
Organism:Homo sapiens (Human)
Description:P10632
Residue:490
BDBM50012060
NameBDBM50012060
Synonyms:CHEMBL3263640
TypeSmall organic molecule
Emp. Form.C34H35N7O3
Mol. Mass.589.6868
SMILESCc1c(NC(=O)c2ccc(cc2)C(C)(C)C)cccc1-c1nc(Nc2ccc(cc2)C(=O)N2CCOCC2)c2nc[nH]c2n1