Reaction Details
TargetMineralocorticoid receptor
LigandBDBM50324199
Substrate/Competitorn/a
Meas. Tech.ChEMBL_1348998 (CHEMBL3265996)
IC50 15±n/a nM
Citation Casimiro-Garcia, APiotrowski, DWAmbler, CArhancet, GBBanker, MEBanks, TBoustany-Kari, CMCai, CChen, XEudy, RHepworth, DHulford, CAJennings, SMLoria, PMMeyers, MJPetersen, DNRaheja, NKSammons, MShe, LSong, KVrieze, DWei, L Identification of (R)-6-(1-(4-cyano-3-methylphenyl)-5-cyclopentyl-4,5-dihydro-1H-pyrazol-3-yl)-2-methoxynicotinic acid, a highly potent and selective nonsteroidal mineralocorticoid receptor antagonist. J Med Chem57:4273-88 (2014) 
 
Mineralocorticoid receptor
Name:Mineralocorticoid receptor
Type:Enzyme
Mol. Mass.:107076.42
Organism:Homo sapiens (Human)
Description:P08235
Residue:984
BDBM50324199
NameBDBM50324199
Synonyms:4-[(5R)-1-(3-Chloro-4-cyanophenyl)-5-cyclopentyl-4,5-dihydro-1H-pyrazol-3-yl]-2-methoxybenzoic Acid | CHEMBL1215130
TypeSmall organic molecule
Emp. Form.C23H22ClN3O3
Mol. Mass.423.892
SMILESCOc1cc(ccc1C(O)=O)C1=NN([C@H](C1)C1CCCC1)c1ccc(C#N)c(Cl)c1