Reaction Details
TargetAndrogen receptor
LigandBDBM50013430
Substrate/Competitorn/a
Meas. Tech.ChEMBL_1349007 (CHEMBL3266005)
IC50>10000±n/a nM
Citation Casimiro-Garcia, APiotrowski, DWAmbler, CArhancet, GBBanker, MEBanks, TBoustany-Kari, CMCai, CChen, XEudy, RHepworth, DHulford, CAJennings, SMLoria, PMMeyers, MJPetersen, DNRaheja, NKSammons, MShe, LSong, KVrieze, DWei, L Identification of (R)-6-(1-(4-cyano-3-methylphenyl)-5-cyclopentyl-4,5-dihydro-1H-pyrazol-3-yl)-2-methoxynicotinic acid, a highly potent and selective nonsteroidal mineralocorticoid receptor antagonist. J Med Chem57:4273-88 (2014) 
 
Androgen receptor
Name:Androgen receptor
Type:Receptor
Mol. Mass.:99185.27
Organism:Homo sapiens (Human)
Description:CHO cells were stably transfected with human AR gene.
Residue:920
BDBM50013430
NameBDBM50013430
Synonyms:CHEMBL3263768
TypeSmall organic molecule
Emp. Form.C24H25N9O2
Mol. Mass.471.5144
SMILESCOc1nc(ccc1C(=O)Nc1nnn[nH]1)C1=NN([C@H](C1)C1CCCC1)c1ccc(C#N)c(C)c1