Reaction Details
TargetMast/stem cell growth factor receptor Kit
LigandBDBM50015448
Substrate/Competitorn/a
Meas. Tech.ChEMBL_1348201 (CHEMBL3270316)
EC50 445±n/a nM
Citation Currie, KSKropf, JELee, TBlomgren, PXu, JZhao, ZGallion, SWhitney, JAMaclin, DLansdon, EBMaciejewski, PRossi, AMRong, HMacaluso, JBarbosa, JDi Paolo, JAMitchell, SA Discovery of GS-9973, a selective and orally efficacious inhibitor of spleen tyrosine kinase. J Med Chem57:3856-73 (2014) 
 
Mast/stem cell growth factor receptor Kit
Name:Mast/stem cell growth factor receptor Kit
Type:PROTEIN
Mol. Mass.:109349.62
Organism:Mus musculus
Description:ChEMBL_1348201
Residue:979
BDBM50015448
NameBDBM50015448
Synonyms:CHEMBL3265032
TypeSmall organic molecule
Emp. Form.C23H21N7O
Mol. Mass.411.4591
SMILESC1CN(CCO1)c1ccc(Nc2nc(cn3ccnc23)-c2ccc3cn[nH]c3c2)cc1