Reaction Details
TargetMast/stem cell growth factor receptor Kit
LigandBDBM60665
Substrate/Competitorn/a
Meas. Tech.ChEMBL_1348201 (CHEMBL3270316)
EC50 46±n/a nM
Citation Currie, KSKropf, JELee, TBlomgren, PXu, JZhao, ZGallion, SWhitney, JAMaclin, DLansdon, EBMaciejewski, PRossi, AMRong, HMacaluso, JBarbosa, JDi Paolo, JAMitchell, SA Discovery of GS-9973, a selective and orally efficacious inhibitor of spleen tyrosine kinase. J Med Chem57:3856-73 (2014) 
 
Mast/stem cell growth factor receptor Kit
Name:Mast/stem cell growth factor receptor Kit
Type:PROTEIN
Mol. Mass.:109349.62
Organism:Mus musculus
Description:ChEMBL_1348201
Residue:979
BDBM60665
NameBDBM60665
Synonyms:BDBM50249542 US9212178, R406
Typen/a
Emp. Form.C22H23FN6O5
Mol. Mass.470.4536
SMILESCOc1cc(Nc2ncc(F)c(Nc3ccc4OC(C)(C)C(=O)Nc4n3)n2)cc(OC)c1OC