Reaction Details
TargetMetabotropic glutamate receptor 3
LigandBDBM50017228
Substrate/Competitorn/a
Meas. Tech.ChEMBL_1361354 (CHEMBL3293518)
EC50 3400±n/a nM
Citation Dhanya, RPSheffler, DJDahl, RDavis, MLee, PSYang, LNickols, HHCho, HPSmith, LHD'Souza, MSConn, PJDer-Avakian, AMarkou, ACosford, ND Design and synthesis of systemically active metabotropic glutamate subtype-2 and -3 (mGlu2/3) receptor positive allosteric modulators (PAMs): pharmacological characterization and assessment in a rat model of cocaine dependence. J Med Chem57:4154-72 (2014) 
 
Metabotropic glutamate receptor 3
Name:Metabotropic glutamate receptor 3
Type:Protein
Mol. Mass.:98971.84
Organism:Rattus norvegicus (Rat)
Description:P31422
Residue:879
BDBM50017228
NameBDBM50017228
Synonyms:CHEMBL3287676 | US10099993, Compound 25
TypeSmall organic molecule
Emp. Form.C25H30O6
Mol. Mass.426.5021
SMILESCc1c(O)c(ccc1OCCCCOc1cccc(c1)C(O)=O)C(=O)CC1CCCC1