Reaction Details
TargetMetabotropic glutamate receptor 2
LigandBDBM50017288
Substrate/Competitorn/a
Meas. Tech.ChEMBL_1361352 (CHEMBL3293516)
EC50 113±n/a nM
Citation Dhanya, RPSheffler, DJDahl, RDavis, MLee, PSYang, LNickols, HHCho, HPSmith, LHD'Souza, MSConn, PJDer-Avakian, AMarkou, ACosford, ND Design and synthesis of systemically active metabotropic glutamate subtype-2 and -3 (mGlu2/3) receptor positive allosteric modulators (PAMs): pharmacological characterization and assessment in a rat model of cocaine dependence. J Med Chem57:4154-72 (2014) 
 
Metabotropic glutamate receptor 2
Name:Metabotropic glutamate receptor 2
Type:Enzyme
Mol. Mass.:95584.88
Organism:Homo sapiens (Human)
Description:Q14416
Residue:872
BDBM50017288
NameBDBM50017288
Synonyms:CHEMBL3287713 | US10099993, Compound 62
TypeSmall organic molecule
Emp. Form.C23H28O7
Mol. Mass.416.4642
SMILESCOc1cc(ccc1OCCCCOc1ccc(C(=O)C(C)C)c(O)c1C)C(O)=O