Reaction Details
TargetMetabotropic glutamate receptor 2
LigandBDBM50017263
Substrate/Competitorn/a
Meas. Tech.ChEMBL_1361352 (CHEMBL3293516)
EC50 171±n/a nM
Citation Dhanya, RPSheffler, DJDahl, RDavis, MLee, PSYang, LNickols, HHCho, HPSmith, LHD'Souza, MSConn, PJDer-Avakian, AMarkou, ACosford, ND Design and synthesis of systemically active metabotropic glutamate subtype-2 and -3 (mGlu2/3) receptor positive allosteric modulators (PAMs): pharmacological characterization and assessment in a rat model of cocaine dependence. J Med Chem57:4154-72 (2014) 
 
Metabotropic glutamate receptor 2
Name:Metabotropic glutamate receptor 2
Type:Enzyme
Mol. Mass.:95584.88
Organism:Homo sapiens (Human)
Description:Q14416
Residue:872
BDBM50017263
NameBDBM50017263
Synonyms:CHEMBL3287716 | US10099993, Compound 65
TypeSmall organic molecule
Emp. Form.C22H25FO6
Mol. Mass.404.4287
SMILESCC(C)C(=O)c1ccc(OCCCCOc2ccc(F)c(c2)C(O)=O)c(C)c1O