Reaction Details
TargetIntegrase
LigandBDBM50021275
Substrate/Competitorn/a
Meas. Tech.ChEMBL_1366288 (CHEMBL3297621)
Kd 1100±n/a nM
Citation Fader, LDCarson, RMorin, SBilodeau, FChabot, CHalmos, TBailey, MDKawai, SHCoulombe, RLaplante, SMekhssian, KJakalian, AGarneau, MDuan, JMason, SWSimoneau, BFenwick, CTsantrizos, YYoakim, C Minimizing the Contribution of Enterohepatic Recirculation to Clearance in Rat for the NCINI Class of Inhibitors of HIV. ACS Med Chem Lett5:711-6 (2014) 
 
Integrase
Name:Integrase
Synonyms:Human immunodeficiency virus type 1 integrase
Type:PROTEIN
Mol. Mass.:32231.48
Organism:Human immunodeficiency virus 1
Description:ChEMBL_90865
Residue:288
BDBM50021275
NameBDBM50021275
Synonyms:CHEMBL3287911
TypeSmall organic molecule
Emp. Form.C30H33NO4
Mol. Mass.471.5873
SMILESCc1nc-2c(CCCc3ccccc-23)c(-c2ccc3OCCCc3c2)c1[C@H](OC(C)(C)C)C(O)=O