Reaction Details
TargetIntegrase
LigandBDBM50021287
Substrate/Competitorn/a
Meas. Tech.ChEMBL_1366289 (CHEMBL3297622)
Kd 24±n/a nM
Citation Fader, LDCarson, RMorin, SBilodeau, FChabot, CHalmos, TBailey, MDKawai, SHCoulombe, RLaplante, SMekhssian, KJakalian, AGarneau, MDuan, JMason, SWSimoneau, BFenwick, CTsantrizos, YYoakim, C Minimizing the Contribution of Enterohepatic Recirculation to Clearance in Rat for the NCINI Class of Inhibitors of HIV. ACS Med Chem Lett5:711-6 (2014) 
 
Integrase
Name:Integrase
Synonyms:Human immunodeficiency virus type 1 integrase
Type:PROTEIN
Mol. Mass.:32231.48
Organism:Human immunodeficiency virus 1
Description:ChEMBL_90865
Residue:288
BDBM50021287
NameBDBM50021287
Synonyms:CHEMBL3287920
TypeSmall organic molecule
Emp. Form.C33H34N2O4
Mol. Mass.522.6341
SMILESCc1nc(c(C)c(-c2ccc3OCCCc3c2)c1[C@H](OC(C)(C)C)C(O)=O)-c1ccc(cc1)-c1ccncc1