Reaction Details
TargetIntegrase
LigandBDBM50021326
Substrate/Competitorn/a
Meas. Tech.ChEMBL_1366289 (CHEMBL3297622)
Kd 40±n/a nM
Citation Fader, LDCarson, RMorin, SBilodeau, FChabot, CHalmos, TBailey, MDKawai, SHCoulombe, RLaplante, SMekhssian, KJakalian, AGarneau, MDuan, JMason, SWSimoneau, BFenwick, CTsantrizos, YYoakim, C Minimizing the Contribution of Enterohepatic Recirculation to Clearance in Rat for the NCINI Class of Inhibitors of HIV. ACS Med Chem Lett5:711-6 (2014) 
 
Integrase
Name:Integrase
Synonyms:Human immunodeficiency virus type 1 integrase
Type:PROTEIN
Mol. Mass.:32231.48
Organism:Human immunodeficiency virus 1
Description:ChEMBL_90865
Residue:288
BDBM50021326
NameBDBM50021326
Synonyms:CHEMBL3287924
TypeSmall organic molecule
Emp. Form.C27H30ClNO3
Mol. Mass.451.985
SMILESCc1ccc(cc1C)-c1nc(C)c([C@H](OC(C)(C)C)C(O)=O)c(c1C)-c1ccc(Cl)cc1