Reaction Details
TargetRibosomal protein S6 kinase alpha-3
LigandBDBM50021666
Substrate/Competitorn/a
Meas. Tech.ChEMBL_1368329 (CHEMBL868675)
IC50 210±n/a nM
Citation Costales, AMathur, MRamurthy, SLan, JSubramanian, SJain, RAtallah, GSetti, LLindvall, MAppleton, BAOrnelas, EFeucht, PWarne, BDoyle, LBasham, SEAronchik, IJefferson, ABShafer, CM 2-Amino-7-substituted benzoxazole analogs as potent RSK2 inhibitors. Bioorg Med Chem Lett24:1592-6 (2014) 
 
Ribosomal protein S6 kinase alpha-3
Name:Ribosomal protein S6 kinase alpha-3
Type:Serine/threonine-protein kinase
Mol. Mass.:83740.03
Organism:Homo sapiens (Human)
Description:The human RSK2 sequence differed from the Genbank entry NM_004586 at one residue, V45G. The protein was cloned and purified from baculovirus expression system.
Residue:740
BDBM50021666
NameBDBM50021666
Synonyms:CHEMBL3297947
TypeSmall organic molecule
Emp. Form.C22H19FN2O4
Mol. Mass.394.3957
SMILESCOc1cc(Nc2nc3cccc(-c4c(F)cccc4OC)c3o2)cc(OC)c1