Reaction Details
TargetTyrosine-protein kinase JAK2
LigandBDBM50021658
Substrate/Competitorn/a
Meas. Tech.ChEMBL_1368326 (CHEMBL868672)
IC50 460±n/a nM
Citation Costales, AMathur, MRamurthy, SLan, JSubramanian, SJain, RAtallah, GSetti, LLindvall, MAppleton, BAOrnelas, EFeucht, PWarne, BDoyle, LBasham, SEAronchik, IJefferson, ABShafer, CM 2-Amino-7-substituted benzoxazole analogs as potent RSK2 inhibitors. Bioorg Med Chem Lett24:1592-6 (2014) 
 
Tyrosine-protein kinase JAK2
Name:Tyrosine-protein kinase JAK2
Type:Protein
Mol. Mass.:130684.68
Organism:Homo sapiens (Human)
Description:O60674
Residue:1132
BDBM50021658
NameBDBM50021658
Synonyms:CHEMBL3298194
TypeSmall organic molecule
Emp. Form.C23H20N4O4
Mol. Mass.416.4293
SMILESCOc1cc(Nc2nc3cccc(-c4cccc5[nH]cnc45)c3o2)cc(OC)c1OC