Reaction Details
TargetAurora kinase A
LigandBDBM50021658
Substrate/Competitorn/a
Meas. Tech.ChEMBL_1368327 (CHEMBL868673)
IC50 600±n/a nM
Citation Costales, AMathur, MRamurthy, SLan, JSubramanian, SJain, RAtallah, GSetti, LLindvall, MAppleton, BAOrnelas, EFeucht, PWarne, BDoyle, LBasham, SEAronchik, IJefferson, ABShafer, CM 2-Amino-7-substituted benzoxazole analogs as potent RSK2 inhibitors. Bioorg Med Chem Lett24:1592-6 (2014) 
 
Aurora kinase A
Name:Aurora kinase A
Type:Serine/threonine-protein kinase
Mol. Mass.:45830.98
Organism:Homo sapiens (Human)
Description:O14965
Residue:403
BDBM50021658
NameBDBM50021658
Synonyms:CHEMBL3298194
TypeSmall organic molecule
Emp. Form.C23H20N4O4
Mol. Mass.416.4293
SMILESCOc1cc(Nc2nc3cccc(-c4cccc5[nH]cnc45)c3o2)cc(OC)c1OC