Reaction Details
TargetRibosomal protein S6 kinase alpha-3
LigandBDBM50021684
Substrate/Competitorn/a
Meas. Tech.ChEMBL_1368329 (CHEMBL868675)
IC50 9300±n/a nM
Citation Costales, AMathur, MRamurthy, SLan, JSubramanian, SJain, RAtallah, GSetti, LLindvall, MAppleton, BAOrnelas, EFeucht, PWarne, BDoyle, LBasham, SEAronchik, IJefferson, ABShafer, CM 2-Amino-7-substituted benzoxazole analogs as potent RSK2 inhibitors. Bioorg Med Chem Lett24:1592-6 (2014) 
 
Ribosomal protein S6 kinase alpha-3
Name:Ribosomal protein S6 kinase alpha-3
Type:Serine/threonine-protein kinase
Mol. Mass.:83740.03
Organism:Homo sapiens (Human)
Description:The human RSK2 sequence differed from the Genbank entry NM_004586 at one residue, V45G. The protein was cloned and purified from baculovirus expression system.
Residue:740
BDBM50021684
NameBDBM50021684
Synonyms:CHEMBL3298191
TypeSmall organic molecule
Emp. Form.C25H22N4O4
Mol. Mass.442.4666
SMILESCOc1cc(Nc2nc3cccc(-c4ccccc4-c4cn[nH]c4)c3o2)cc(OC)c1OC