Reaction Details
TargetRibosomal protein S6 kinase alpha-3
LigandBDBM50021673
Substrate/Competitorn/a
Meas. Tech.ChEMBL_1368328 (CHEMBL868674)
IC50>20000±n/a nM
Citation Costales, AMathur, MRamurthy, SLan, JSubramanian, SJain, RAtallah, GSetti, LLindvall, MAppleton, BAOrnelas, EFeucht, PWarne, BDoyle, LBasham, SEAronchik, IJefferson, ABShafer, CM 2-Amino-7-substituted benzoxazole analogs as potent RSK2 inhibitors. Bioorg Med Chem Lett24:1592-6 (2014) 
 
Ribosomal protein S6 kinase alpha-3
Name:Ribosomal protein S6 kinase alpha-3
Type:Serine/threonine-protein kinase
Mol. Mass.:83740.03
Organism:Homo sapiens (Human)
Description:The human RSK2 sequence differed from the Genbank entry NM_004586 at one residue, V45G. The protein was cloned and purified from baculovirus expression system.
Residue:740
BDBM50021673
NameBDBM50021673
Synonyms:CHEMBL3297843
TypeSmall organic molecule
Emp. Form.C20H21FN2O2
Mol. Mass.340.3913
SMILESCOc1cccc(F)c1-c1cccc2nc(NC3CCCCC3)oc12