Reaction Details
TargetFarnesyl pyrophosphate synthase
LigandBDBM50421094
Substrate/Competitorn/a
Meas. Tech.ChEMBL_1368841
IC50 200±n/a nM
Citation De Schutter, JWPark, JLeung, CYGormley, PLin, YSHu, ZBerghuis, AMPoirier, JTsantrizos, YS Multistage screening reveals chameleon ligands of the human farnesyl pyrophosphate synthase: implications to drug discovery for neurodegenerative diseases. J Med Chem57:5764-76 (2014) 
 
Farnesyl pyrophosphate synthase
Name:Farnesyl pyrophosphate synthase
Type:Enzyme
Mol. Mass.:48272.89
Organism:Homo sapiens (Human)
Description:P14324
Residue:419
BDBM50421094
NameBDBM50421094
Synonyms:CHEMBL2088339
TypeSmall organic molecule
Emp. Form.C15H18N2O7P2
Mol. Mass.400.2601
SMILESOP(O)(=O)C(Nc1cncc(c1)-c1ccc(OC2CC2)cc1)P(O)(O)=O