Reaction Details
TargetFarnesyl pyrophosphate synthase
LigandBDBM50443052
Substrate/Competitorn/a
Meas. Tech.ChEMBL_1368841
IC50 200±n/a nM
Citation De Schutter, JWPark, JLeung, CYGormley, PLin, YSHu, ZBerghuis, AMPoirier, JTsantrizos, YS Multistage screening reveals chameleon ligands of the human farnesyl pyrophosphate synthase: implications to drug discovery for neurodegenerative diseases. J Med Chem57:5764-76 (2014) 
 
Farnesyl pyrophosphate synthase
Name:Farnesyl pyrophosphate synthase
Type:Enzyme
Mol. Mass.:48272.89
Organism:Homo sapiens (Human)
Description:P14324
Residue:419
BDBM50443052
NameBDBM50443052
Synonyms:CHEMBL3087936 | US11279719, Example C-13
TypeSmall organic molecule
Emp. Form.C16H17N3O7P2S
Mol. Mass.457.335
SMILESOP(O)(=O)C(Nc1ncnc2sc(cc12)-c1ccc(OC2CC2)cc1)P(O)(O)=O