Reaction Details
TargetFarnesyl pyrophosphate synthase
LigandBDBM50022666
Substrate/Competitorn/a
Meas. Tech.ChEMBL_1368838
IC50>20000±n/a nM
Citation De Schutter, JWPark, JLeung, CYGormley, PLin, YSHu, ZBerghuis, AMPoirier, JTsantrizos, YS Multistage screening reveals chameleon ligands of the human farnesyl pyrophosphate synthase: implications to drug discovery for neurodegenerative diseases. J Med Chem57:5764-76 (2014) 
 
Farnesyl pyrophosphate synthase
Name:Farnesyl pyrophosphate synthase
Type:Enzyme
Mol. Mass.:48272.89
Organism:Homo sapiens (Human)
Description:P14324
Residue:419
BDBM50022666
NameBDBM50022666
Synonyms:CHEMBL3299050
TypeSmall organic molecule
Emp. Form.C15H13N3O2S
Mol. Mass.299.348
SMILESCc1ccc(cc1)-c1cc2c(NCC(O)=O)ncnc2s1