Reaction Details
TargetHepatocyte growth factor receptor
LigandBDBM50023342
Substrate/Competitorn/a
Meas. Tech.ChEMBL_1459611 (CHEMBL3369646)
IC50 5.0±n/a nM
Citation Jia, HDai, GWeng, JZhang, ZWang, QZhou, FJiao, LCui, YRen, YFan, SZhou, JQing, WGu, YWang, JSai, YSu, W Discovery of (S)-1-(1-(Imidazo[1,2-a]pyridin-6-yl)ethyl)-6-(1-methyl-1H-pyrazol-4-yl)-1H-[1,2,3]triazolo[4,5-b]pyrazine (volitinib) as a highly potent and selective mesenchymal-epithelial transition factor (c-Met) inhibitor in clinical development for treatment of cancer. J Med Chem57:7577-89 (2014) 
 
Hepatocyte growth factor receptor
Name:Hepatocyte growth factor receptor
Type:Protein
Mol. Mass.:155559.73
Organism:Homo sapiens (Human)
Description:P08581
Residue:1390
BDBM50023342
NameBDBM50023342
Synonyms:CHEMBL3334567
TypeSmall organic molecule
Emp. Form.C17H15N9
Mol. Mass.345.3613
SMILESC[C@@H](c1ccc2nccn2c1)n1nnc2ncc(nc12)-c1cnn(C)c1