Reaction Details
TargetEnv polyprotein
LigandBDBM50023610
Substrate/Competitorn/a
Meas. Tech.ChEMBL_1455145 (CHEMBL3366758)
IC50 8310±n/a nM
Citation Wang, CLu, LNa, HLi, XWang, QJiang, XXu, XYu, FZhang, TLi, JZhang, ZZheng, BLiang, GCai, LJiang, SLiu, K Conjugation of a nonspecific antiviral sapogenin with a specific HIV fusion inhibitor: a promising strategy for discovering new antiviral therapeutics. J Med Chem57:7342-54 (2014) 
 
Env polyprotein
Name:Env polyprotein
Type:PROTEIN
Mol. Mass.:14017.92
Organism:Human immunodeficiency virus 1
Description:ChEMBL_109731
Residue:124
BDBM50023610
NameBDBM50023610
Synonyms:CHEMBL3341857
TypeSmall organic molecule
Emp. Form.C182H286N44O57
Mol. Mass.4002.4788
SMILES[H][C@@]12CC(C)(C)CC[C@@]1(CC[C@]1(C)C2=CC[C@]2([H])[C@@]3(C)CC[C@H](OC(=O)CCc4cn(CC(=O)NCCCC[C@H](NC(=O)CCNC(=O)[C@H](CC(C)C)NC(=O)[C@H](CC(C)C)NC(=O)[C@H](CCC(O)=O)NC(=O)[C@H](CCC(N)=O)NC(=O)[C@H](CCC(O)=O)NC(=O)[C@H](CC(N)=O)NC(=O)[C@H](CCCCN)NC(=O)[C@H](CCC(O)=O)NC(=O)[C@H](CCC(N)=O)NC(=O)[C@H](CCC(N)=O)NC(=O)[C@H](CC(N)=O)NC(=O)[C@H](CCC(N)=O)NC(=O)[C@H](CO)NC(=O)[C@H](CCC(O)=O)NC(=O)[C@H](CCC(O)=O)NC(=O)[C@@H](NC(=O)[C@H](CC(C)C)NC(=O)[C@H](CO)NC(=O)[C@H](Cc5cnc[nH]5)NC(=O)[C@@H](NC(=O)[C@H](CC(C)C)NC(=O)[C@H](CO)NC(=O)[C@@H](NC(=O)[C@H](Cc5ccc(O)cc5)NC(=O)[C@H](CC(N)=O)NC(=O)[C@H](CC(N)=O)NC(C)=O)[C@@H](C)O)[C@@H](C)CC)[C@@H](C)CC)C(N)=O)nn4)C(C)(C)[C@]3([H])CC[C@@]12C)C(=O)OCC=C