Reaction Details
TargetEnv polyprotein
LigandBDBM50023615
Substrate/Competitorn/a
Meas. Tech.ChEMBL_1455143 (CHEMBL3366756)
EC50 542±n/a nM
Citation Wang, CLu, LNa, HLi, XWang, QJiang, XXu, XYu, FZhang, TLi, JZhang, ZZheng, BLiang, GCai, LJiang, SLiu, K Conjugation of a nonspecific antiviral sapogenin with a specific HIV fusion inhibitor: a promising strategy for discovering new antiviral therapeutics. J Med Chem57:7342-54 (2014) 
 
Env polyprotein
Name:Env polyprotein
Type:PROTEIN
Mol. Mass.:14017.92
Organism:Human immunodeficiency virus 1
Description:ChEMBL_109731
Residue:124
BDBM50023615
NameBDBM50023615
Synonyms:CHEBI:608828 Enfuvirtide Fuzeon T-20 | Pentafuside
TypeSmall organic molecule
Emp. Form.C204H301N51O64
Mol. Mass.4491.876
SMILESCC[C@H](C)[C@H](NC(=O)[C@H](CC(C)C)NC(=O)[C@H](CO)NC(=O)[C@H](Cc1cnc[nH]1)NC(=O)[C@@H](NC(=O)[C@H](CC(C)C)NC(=O)[C@H](CO)NC(=O)[C@@H](NC(=O)[C@H](Cc1ccc(O)cc1)NC(C)=O)[C@@H](C)O)[C@@H](C)CC)C(=O)N[C@@H](CCC(O)=O)C(=O)N[C@@H](CCC(O)=O)C(=O)N[C@@H](CO)C(=O)N[C@@H](CCC(N)=O)C(=O)N[C@@H](CC(N)=O)C(=O)N[C@@H](CCC(N)=O)C(=O)N[C@@H](CCC(N)=O)C(=O)N[C@@H](CCC(O)=O)C(=O)N[C@@H](CCCCN)C(=O)N[C@@H](CC(N)=O)C(=O)N[C@@H](CCC(O)=O)C(=O)N[C@@H](CCC(N)=O)C(=O)N[C@@H](CCC(O)=O)C(=O)N[C@@H](CC(C)C)C(=O)N[C@@H](CC(C)C)C(=O)N[C@@H](CCC(O)=O)C(=O)N[C@@H](CC(C)C)C(=O)N[C@@H](CC(O)=O)C(=O)N[C@@H](CCCCN)C(=O)N[C@@H](Cc1c[nH]c2ccccc12)C(=O)N[C@@H](C)C(=O)N[C@@H](CO)C(=O)N[C@@H](CC(C)C)C(=O)N[C@@H](Cc1c[nH]c2ccccc12)C(=O)N[C@@H](CC(N)=O)C(=O)N[C@@H](Cc1c[nH]c2ccccc12)C(=O)N[C@@H](Cc1ccccc1)C(N)=O